Target
Melanocyte-stimulating hormone receptor
Ligand
BDBM50500591
Substrate
Meas. Tech.
ChEMBL_1548272 (CHEMBL3755539)
EC50
>1000±n/a nM
Citation
 Carotenuto, AMerlino, FCai, MBrancaccio, DYousif, AMNovellino, EHruby, VJGrieco, P Discovery of Novel Potent and Selective Agonists at the Melanocortin-3 Receptor. J Med Chem 58:9773-8 (2015)  
Target
Name:
Melanocyte-stimulating hormone receptor
Synonyms:
MC1-R MSH-R MSHR_HUMAN Melanocortin receptor (M1 and M4) Melanocortin receptor 1 (MC1-R) | Melanocortin receptor 1 (MC1R)
Type:
Enzyme
Mol. Mass.:
34717.23
Organism:
Homo sapiens (Human)
Description:
Q01726
Residue:
317
  
Inhibitor
Name:
BDBM50500591
Synonyms:
CHEMBL4299441
Type:
Small organic molecule
Emp. Form.:
C64H81N15O10
Mol. Mass.:
1220.4224
SMILES:
[H][C@]12CCCN1C(=O)[C@@H](Cc1c[nH]c3ccccc13)NC(=O)[C@@H](CC(=O)NCCCC[C@@H](NC(=O)[C@H](Cc1c[nH]c3ccccc13)NC(=O)[C@H](CCCNC(N)=N)NC(=O)[C@H](Cc1ccc3ccccc3c1)NC2=O)C(N)=O)NC(=O)[C@H](CCCC)NC(C)=O
: