Target
Histone-lysine N-methyltransferase SMYD3
Ligand
BDBM378446
Substrate
Meas. Tech.
ChEMBL_1576442 (CHEMBL3803119)
IC50
1.000000±n/a nM
Citation
 Mitchell, LHBoriack-Sjodin, PASmith, SThomenius, MRioux, NMunchhof, MMills, JEKlaus, CTotman, JRiera, TVRaimondi, AJacques, SLWest, KFoley, MWaters, NJKuntz, KWWigle, TJScott, MPCopeland, RASmith, JJChesworth, R Novel Oxindole Sulfonamides and Sulfamides: EPZ031686, the First Orally Bioavailable Small Molecule SMYD3 Inhibitor. ACS Med Chem Lett 7:134-8 (2016)  
Target
Name:
Histone-lysine N-methyltransferase SMYD3
Synonyms:
SET and MYND domain-containing protein 3 SMYD3_HUMAN ZNFN3A1 | Zinc finger MYND domain-containing protein 1
Type:
Enzyme
Mol. Mass.:
49101.22
Organism:
Homo sapiens (Human)
Description:
Q9H7B4-2
Residue:
428
  
Inhibitor
Name:
BDBM378446
Synonyms:
N-((1R,3r,5S)-8-((4-aminopiperidin-1-yl)sulfonyl)-8-azabicyclo[3.2.1]octan-3-yl)-6-chloro-2-oxoindoline-5-carboxamide | US10266526, Compound 579
Type:
Small organic molecule
Emp. Form.:
C21H28ClN5O4S
Mol. Mass.:
481.996
SMILES:
NC1CCN(CC1)S(=O)(=O)N1[C@H]2CC[C@@H]1C[C@@H](C2)NC(=O)c1cc2CC(=O)Nc2cc1Cl
: