Target
Histamine H3 receptor
Ligand
BDBM50051194
Substrate
Meas. Tech.
ChEMBL_86902 (CHEMBL698412)
Ki
50±n/a nM
Citation
 Stark, HPurand, KLigneau, XRouleau, AArrang, JMGarbarg, MSchwartz, JCSchunack, W Novel carbamates as potent histamine H3 receptor antagonists with high in vitro and oral in vivo activity. J Med Chem 39:1157-63 (1996)  
Target
Name:
Histamine H3 receptor
Synonyms:
HH3R Hrh3
Type:
G Protein-Coupled Receptor (GPCR)
Mol. Mass.:
48607.98
Organism:
Rattus norvegicus (rat)
Description:
Residue:
445
  
Inhibitor
Name:
BDBM50051194
Synonyms:
(3-{[3-(1H-Imidazol-4-yl)-propoxycarbonylamino]-methyl}-benzyl)-carbamic acid 3-(1H-imidazol-4-yl)-propyl ester | CHEMBL415989
Type:
Small organic molecule
Emp. Form.:
C22H28N6O4
Mol. Mass.:
440.4955
SMILES:
O=C(NCc1cccc(CNC(=O)OCCCc2cnc[nH]2)c1)OCCCc1cnc[nH]1
: