Target
Sterol O-acyltransferase 1
Ligand
BDBM50051900
Substrate
Meas. Tech.
ChEMBL_28796 (CHEMBL641706)
IC50
275±n/a nM
Citation
 Astles, PCAshton, MJBridge, AWHarris, NVHart, TWParrott, DPPorter, BRiddell, DSmith, CWilliams, RJ Acyl-CoA:Cholesterol O-acyltransferase (ACAT) inhibitors. 2. 2-(1,3-Dioxan-2-yl)-4,5-diphenyl-1H-imidazoles as potent inhibitors of ACAT. J Med Chem 39:1423-32 (1996)  
Target
Name:
Sterol O-acyltransferase 1
Synonyms:
ACAT-1 Acat SOAT1_RAT Sterol O-acyltransferase, Soat
Type:
PROTEIN
Mol. Mass.:
64165.56
Organism:
Rattus norvegicus
Description:
ChEMBL_28796
Residue:
545
  
Inhibitor
Name:
BDBM50051900
Synonyms:
CHEMBL34221 | [2-(4,5-Diphenyl-1H-imidazol-2-yl)-5-hydroxymethyl-[1,3]dioxan-5-yl]-methanol
Type:
Small organic molecule
Emp. Form.:
C21H22N2O4
Mol. Mass.:
366.4104
SMILES:
OCC1(CO)COC(OC1)c1nc(c([nH]1)-c1ccccc1)-c1ccccc1
: