Target
Translocator protein
Ligand
BDBM50054135
Substrate
Meas. Tech.
ChEMBL_39466 (CHEMBL653041)
IC50
1600±n/a nM
Citation
 Anzini, MCappelli, AVomero, SGiorgi, GLanger, TBruni, GRomeo, MRBasile, AS Molecular basis of peripheral vs central benzodiazepine receptor selectivity in a new class of peripheral benzodiazepine receptor ligands related to alpidem. J Med Chem 39:4275-84 (1996)  
Target
Name:
Translocator protein
Synonyms:
Benzodiazepine receptors; peripheral & central Mbr PBR Peripheral benzodiazepine receptor (PBR) TSPO_RAT | Tspo
Type:
Mitochondrion membrane protein
Mol. Mass.:
18945.84
Organism:
Rattus norvegicus (rat)
Description:
Competitive binding experiments were performed on rat kidney mitochondrial membranes.
Residue:
169
  
Inhibitor
Name:
BDBM50054135
Synonyms:
2-[6-(4-Chloro-phenyl)-5-oxo-6,7-dihydro-5H-pyrrolo[3,4-b]pyridin-7-yl]-N,N-dihexyl-acetamide | CHEMBL135408
Type:
Small organic molecule
Emp. Form.:
C27H36ClN3O2
Mol. Mass.:
470.047
SMILES:
CCCCCCN(CCCCCC)C(=O)Cc1n(-c2ccc(Cl)cc2)c(=O)c2ccc[nH]c12
: