Target
Carbonic anhydrase 6
Ligand
BDBM50449816
Substrate
Meas. Tech.
ChEMBL_1816904 (CHEMBL4316478)
Kd
170±n/a nM
Citation
 Zak?auskas, A?apkauskait?, EJezep?ikas, LLinkuvien?, VPaketuryt?, VSmirnov, ALeitans, JKazaks, ADvinskis, EManakova, EGra?ulis, STars, KMatulis, D Halogenated and di-substituted benzenesulfonamides as selective inhibitors of carbonic anhydrase isoforms. Eur J Med Chem 185:0 (2020)  
Target
Name:
Carbonic anhydrase 6
Synonyms:
CA-VI CAH6_HUMAN Carbonic Anhydrase VI Carbonic anhydrase 6 Carbonic anhydrase 6 (CA-VI) Salivary carbonic anhydrase | Secreted carbonic anhydrase
Type:
Enzyme
Mol. Mass.:
35371.40
Organism:
Homo sapiens (Human)
Description:
P23280
Residue:
308
  
Inhibitor
Name:
BDBM50449816
Synonyms:
CHEMBL4160149
Type:
Small organic molecule
Emp. Form.:
C11H14Cl2N2O3S
Mol. Mass.:
325.211
SMILES:
CCCCNC(=O)c1cc(c(Cl)cc1Cl)S(N)(=O)=O
: