Target
Carbonic anhydrase 7
Ligand
BDBM50449831
Substrate
Meas. Tech.
ChEMBL_1816905 (CHEMBL4316479)
Kd
10.0±n/a nM
Citation
 Zak?auskas, A?apkauskait?, EJezep?ikas, LLinkuvien?, VPaketuryt?, VSmirnov, ALeitans, JKazaks, ADvinskis, EManakova, EGra?ulis, STars, KMatulis, D Halogenated and di-substituted benzenesulfonamides as selective inhibitors of carbonic anhydrase isoforms. Eur J Med Chem 185:0 (2020)  
Target
Name:
Carbonic anhydrase 7
Synonyms:
CA-VII CAH7_HUMAN Carbonic anhydrase Carbonic anhydrase VII (CA VII)
Type:
Enzyme
Mol. Mass.:
29664.11
Organism:
Homo sapiens (Human)
Description:
Human cloned isozyme.
Residue:
264
  
Inhibitor
Name:
BDBM50449831
Synonyms:
CHEMBL4172331
Type:
Small organic molecule
Emp. Form.:
C9H10Cl2N2O4S
Mol. Mass.:
313.158
SMILES:
NS(=O)(=O)c1cc(C(=O)NCCO)c(Cl)cc1Cl
: