Target
Carbonic anhydrase 4
Ligand
BDBM50449816
Substrate
Meas. Tech.
ChEMBL_1816901 (CHEMBL4316475)
Kd
83±n/a nM
Citation
 Zak?auskas, A?apkauskait?, EJezep?ikas, LLinkuvien?, VPaketuryt?, VSmirnov, ALeitans, JKazaks, ADvinskis, EManakova, EGra?ulis, STars, KMatulis, D Halogenated and di-substituted benzenesulfonamides as selective inhibitors of carbonic anhydrase isoforms. Eur J Med Chem 185:0 (2020)  
Target
Name:
Carbonic anhydrase 4
Synonyms:
CA-IV CAH4_HUMAN Carbonic anhydrase Carbonic anhydrase IV (CA IV)
Type:
Enzyme
Mol. Mass.:
35037.98
Organism:
Homo sapiens (Human)
Description:
P22748
Residue:
312
  
Inhibitor
Name:
BDBM50449816
Synonyms:
CHEMBL4160149
Type:
Small organic molecule
Emp. Form.:
C11H14Cl2N2O3S
Mol. Mass.:
325.211
SMILES:
CCCCNC(=O)c1cc(c(Cl)cc1Cl)S(N)(=O)=O
: