Target
Carbonic anhydrase 5B, mitochondrial
Ligand
BDBM50449816
Substrate
Meas. Tech.
ChEMBL_1816903 (CHEMBL4316477)
Kd
83±n/a nM
Citation
 Zak?auskas, A?apkauskait?, EJezep?ikas, LLinkuvien?, VPaketuryt?, VSmirnov, ALeitans, JKazaks, ADvinskis, EManakova, EGra?ulis, STars, KMatulis, D Halogenated and di-substituted benzenesulfonamides as selective inhibitors of carbonic anhydrase isoforms. Eur J Med Chem 185:0 (2020)  
Target
Name:
Carbonic anhydrase 5B, mitochondrial
Synonyms:
CA-VB CAH5B_HUMAN Carbonic Anhydrase VB Carbonic anhydrase 5B, mitochondrial Carbonic anhydrase V | Carbonic anhydrase VB (CA VB)
Type:
Enzyme
Mol. Mass.:
36440.83
Organism:
Homo sapiens (Human)
Description:
Human (cloned) isozyme
Residue:
317
  
Inhibitor
Name:
BDBM50449816
Synonyms:
CHEMBL4160149
Type:
Small organic molecule
Emp. Form.:
C11H14Cl2N2O3S
Mol. Mass.:
325.211
SMILES:
CCCCNC(=O)c1cc(c(Cl)cc1Cl)S(N)(=O)=O
: