Target
Carbonic anhydrase 4
Ligand
BDBM50449831
Substrate
Meas. Tech.
ChEMBL_1816913 (CHEMBL4316487)
Kd
1.7±n/a nM
Citation
 Zak?auskas, A?apkauskait?, EJezep?ikas, LLinkuvien?, VPaketuryt?, VSmirnov, ALeitans, JKazaks, ADvinskis, EManakova, EGra?ulis, STars, KMatulis, D Halogenated and di-substituted benzenesulfonamides as selective inhibitors of carbonic anhydrase isoforms. Eur J Med Chem 185:0 (2020)  
Target
Name:
Carbonic anhydrase 4
Synonyms:
CA-IV CAH4_HUMAN Carbonic anhydrase Carbonic anhydrase IV (CA IV)
Type:
Enzyme
Mol. Mass.:
35037.98
Organism:
Homo sapiens (Human)
Description:
P22748
Residue:
312
  
Inhibitor
Name:
BDBM50449831
Synonyms:
CHEMBL4172331
Type:
Small organic molecule
Emp. Form.:
C9H10Cl2N2O4S
Mol. Mass.:
313.158
SMILES:
NS(=O)(=O)c1cc(C(=O)NCCO)c(Cl)cc1Cl
: