Target
Carbonic anhydrase 12
Ligand
BDBM50449831
Substrate
Meas. Tech.
ChEMBL_1816907 (CHEMBL4316481)
Kd
130±n/a nM
Citation
 Zak?auskas, A?apkauskait?, EJezep?ikas, LLinkuvien?, VPaketuryt?, VSmirnov, ALeitans, JKazaks, ADvinskis, EManakova, EGra?ulis, STars, KMatulis, D Halogenated and di-substituted benzenesulfonamides as selective inhibitors of carbonic anhydrase isoforms. Eur J Med Chem 185:0 (2020)  
Target
Name:
Carbonic anhydrase 12
Synonyms:
CA-XII CAH12_HUMAN Carbonic anhydrase Carbonic anhydrase XII Carbonic anhydrase XII (CAXII) | Tumor antigen HOM-RCC-3.1.3
Type:
Enzyme
Mol. Mass.:
39456.00
Organism:
Homo sapiens (Human)
Description:
Catalytic domain of human cloned isozyme was used in the assay
Residue:
354
  
Inhibitor
Name:
BDBM50449831
Synonyms:
CHEMBL4172331
Type:
Small organic molecule
Emp. Form.:
C9H10Cl2N2O4S
Mol. Mass.:
313.158
SMILES:
NS(=O)(=O)c1cc(C(=O)NCCO)c(Cl)cc1Cl
: