Target
Carbonic anhydrase 9
Ligand
BDBM50449816
Substrate
Meas. Tech.
ChEMBL_1816906 (CHEMBL4316480)
Kd
50±n/a nM
Citation
 Zak?auskas, A?apkauskait?, EJezep?ikas, LLinkuvien?, VPaketuryt?, VSmirnov, ALeitans, JKazaks, ADvinskis, EManakova, EGra?ulis, STars, KMatulis, D Halogenated and di-substituted benzenesulfonamides as selective inhibitors of carbonic anhydrase isoforms. Eur J Med Chem 185:0 (2020)  
Target
Name:
Carbonic anhydrase 9
Synonyms:
CA-IX CAH9_HUMAN Carbonic anhydrase 9 (CA IX) Carbonic anhydrase 9 precursor Carbonic anhydrase IX (CAIX) Carbonic anhydrases; II & IX MN RCC-associated antigen G250
Type:
Enzyme
Mol. Mass.:
49669.03
Organism:
Homo sapiens (Human)
Description:
Catalytic domain of human cloned isozyme was used in the assay
Residue:
459
  
Inhibitor
Name:
BDBM50449816
Synonyms:
CHEMBL4160149
Type:
Small organic molecule
Emp. Form.:
C11H14Cl2N2O3S
Mol. Mass.:
325.211
SMILES:
CCCCNC(=O)c1cc(c(Cl)cc1Cl)S(N)(=O)=O
: