Target
Thermolysin
Ligand
BDBM50056250
Substrate
Meas. Tech.
ChEMBL_210396 (CHEMBL814126)
IC50
41000±n/a nM
Citation
 Ksander, GMde Jesus, RYuan, AGhai, RDTrapani, AMcMartin, CBohacek, R Ortho-substituted benzofused macrocyclic lactams as zinc metalloprotease inhibitors. J Med Chem 40:495-505 (1997)  
Target
Name:
Thermolysin
Synonyms:
THER_BACTH | npr
Type:
PROTEIN
Mol. Mass.:
60097.54
Organism:
Bacillus thermoproteolyticus
Description:
ChEMBL_1468794
Residue:
548
  
Inhibitor
Name:
BDBM50056250
Synonyms:
(6S,9S)-6-Mercaptomethyl-7-oxo-6,7,8,9,10,11,12,13,14,15-decahydro-5H-8-aza-benzocyclotridecene-9-carboxylic acid | CHEMBL149841
Type:
Small organic molecule
Emp. Form.:
C18H25NO3S
Mol. Mass.:
335.461
SMILES:
OC(=O)[C@@H]1CCCCCCc2ccccc2C[C@H](CS)C(=O)N1
: