Target
Thermolysin
Ligand
BDBM50056254
Substrate
Meas. Tech.
ChEMBL_210396 (CHEMBL814126)
IC50
49000±n/a nM
Citation
 Ksander, GMde Jesus, RYuan, AGhai, RDTrapani, AMcMartin, CBohacek, R Ortho-substituted benzofused macrocyclic lactams as zinc metalloprotease inhibitors. J Med Chem 40:495-505 (1997)  
Target
Name:
Thermolysin
Synonyms:
THER_BACTH | npr
Type:
PROTEIN
Mol. Mass.:
60097.54
Organism:
Bacillus thermoproteolyticus
Description:
ChEMBL_1468794
Residue:
548
  
Inhibitor
Name:
BDBM50056254
Synonyms:
(6R,9S)-9-Mercaptomethyl-8-oxo-5,6,7,8,9,10,11,12,13,14-decahydro-7-aza-benzocyclododecene-6-carboxylic acid | CHEMBL148140
Type:
Small organic molecule
Emp. Form.:
C17H23NO3S
Mol. Mass.:
321.434
SMILES:
OC(=O)[C@H]1Cc2ccccc2CCCCC[C@H](CS)C(=O)N1
: