Target
Thermolysin
Ligand
BDBM50056261
Substrate
Meas. Tech.
ChEMBL_210397 (CHEMBL814127)
IC50
>10000±n/a nM
Citation
 Ksander, GMde Jesus, RYuan, AGhai, RDMcMartin, CBohacek, R Meta-substituted benzofused macrocyclic lactams as zinc metalloprotease inhibitors. J Med Chem 40:506-14 (1997)  
Target
Name:
Thermolysin
Synonyms:
THER_BACTH | npr
Type:
PROTEIN
Mol. Mass.:
60097.54
Organism:
Bacillus thermoproteolyticus
Description:
ChEMBL_1468794
Residue:
548
  
Inhibitor
Name:
BDBM50056261
Synonyms:
(3R,6S)-3-Mercaptomethyl-4-oxo-5-aza-bicyclo[11.3.1]heptadeca-1(16),13(17),14-triene-6-carboxylic acid | CHEMBL147526
Type:
Small organic molecule
Emp. Form.:
C18H25NO3S
Mol. Mass.:
335.461
SMILES:
OC(=O)[C@@H]1CCCCCCc2cccc(C[C@@H](CS)C(=O)N1)c2
: