Target
D(2) dopamine receptor
Ligand
BDBM81993
Substrate
Meas. Tech.
ChEMBL_61124 (CHEMBL672313)
Ki
10±n/a nM
Citation
 Heier, RFDolak, LADuncan, JNHyslop, DKLipton, MFMartin, IJMauragis, MAPiercey, MFNichols, NFSchreur, PJSmith, MWMoon, MW Synthesis and biological activities of (R)-5,6-dihydro-N,N-dimethyl-4H-imidazo[4,5,1-ij]quinolin-5-amine and its metabolites. J Med Chem 40:639-46 (1997)  
Target
Name:
D(2) dopamine receptor
Synonyms:
D(2) dopamine receptor DOPAMINE D2 Long DRD2 Dopamine D2 receptor Dopamine D2 receptor (D2R) Dopamine2-like | d2
Type:
Cell-surface receptors
Mol. Mass.:
50647.10
Organism:
Homo sapiens (Human)
Description:
P14416
Residue:
443
  
Inhibitor
Name:
BDBM81993
Synonyms:
BROMOCRIPTINE Bromocriptine+ (GTP-)
Type:
Emp. Form.:
C32H40BrN5O5
Mol. Mass.:
654.594
SMILES:
CC(C)C[C@@H]1N2C(=O)[C@](NC(=O)[C@H]3CN(C)[C@@H]4Cc5c(Br)[nH]c6cccc(C4=C3)c56)(O[C@@]2(O)[C@@H]2CCCN2C1=O)C(C)C
: