Target
Non-receptor tyrosine-protein kinase TNK1
Ligand
BDBM50505541
Substrate
Meas. Tech.
ChEMBL_1822991 (CHEMBL4322755)
Kd
4.0±n/a nM
Citation
 Hirozane, YToyofuku, MYogo, TTanaka, YSameshima, TMiyahisa, IYoshikawa, M Structure-based rational design of staurosporine-based fluorescent probe with broad-ranging kinase affinity for kinase panel application. Bioorg Med Chem Lett 29:0 (2019)  
Target
Name:
Non-receptor tyrosine-protein kinase TNK1
Synonyms:
Non-receptor tyrosine-protein kinase TNK1 TNK1_HUMAN
Type:
PROTEIN
Mol. Mass.:
72495.61
Organism:
Homo sapiens (Human)
Description:
ChEMBL_774410
Residue:
666
  
Inhibitor
Name:
BDBM50505541
Synonyms:
CHEMBL4465866
Type:
Small organic molecule
Emp. Form.:
C49H54BF2N7O7
Mol. Mass.:
901.804
SMILES:
[H][C@]12C[C@@H](NCCOCCOCCOCCNC(=O)CCC3=[N+]4C(C=C3)=Cc3c(C)cc(C)n3[B-]4(F)F)[C@@H](OC)[C@](C)(O1)n1c3ccccc3c3c4CNC(=O)c4c4c5ccccc5n2c4c13
: