Target
Solute carrier family 22 member 1
Ligand
BDBM50370595
Substrate
Meas. Tech.
ChEMBL_1823590 (CHEMBL4323354)
IC50
2003780±n/a nM
Citation
 Meyer, MJNeumann, VEFriesacher, HRZdrazil, BBrockmöller, JTzvetkov, MV Opioids as Substrates and Inhibitors of the Genetically Highly Variable Organic Cation Transporter OCT1. J Med Chem 62:9890-9905 (2019)  
Target
Name:
Solute carrier family 22 member 1
Synonyms:
Adrenergic Alpha Organic cation transporter 1 SLC22A1 hOCT1
Type:
Enzyme Catalytic Domain
Mol. Mass.:
61154.85
Organism:
Homo sapiens (Human)
Description:
Adrenergic Alpha 0 HUMAN::O15245
Residue:
554
  
Inhibitor
Name:
BDBM50370595
Synonyms:
OXYCODONE US1184575, oxycodone | US9233167, Oxycodone
Type:
Small organic molecule
Emp. Form.:
C18H21NO4
Mol. Mass.:
315.3636
SMILES:
COc1ccc2C[C@H]3N(C)CC[C@@]45[C@@H](Oc1c24)C(=O)CC[C@@]35O
: