Target
Lanosterol 14-alpha demethylase
Ligand
BDBM50505764
Substrate
Meas. Tech.
ChEMBL_1823978 (CHEMBL4323742)
IC50
<500±n/a nM
Citation
 Friggeri, LHargrove, TYWawrzak, ZGuengerich, FPLepesheva, GI Validation of Human Sterol 14?-Demethylase (CYP51) Druggability: Structure-Guided Design, Synthesis, and Evaluation of Stoichiometric, Functionally Irreversible Inhibitors. J Med Chem 62:10391-10401 (2019)  
Target
Name:
Lanosterol 14-alpha demethylase
Synonyms:
CP51A_HUMAN CYP51A1 Cytochrome P450 51 LDM P450-14DM P450LI Sterol 14-alpha demethylase
Type:
Protein
Mol. Mass.:
56817.21
Organism:
Homo sapiens (Human)
Description:
Q16850
Residue:
509
  
Inhibitor
Name:
BDBM50505764
Synonyms:
CHEMBL4461447
Type:
Small organic molecule
Emp. Form.:
C38H28ClFN6O4S
Mol. Mass.:
719.183
SMILES:
CS(=O)(=O)c1cc(cc(c1)-c1ccccn1)-c1nnc(o1)-c1ccc(cc1)C(=O)N[C@@H](Cn1ccnc1)c1ccc(cc1Cl)-c1ccc(F)cc1
: