Target
Epithelial discoidin domain-containing receptor 1
Ligand
BDBM50505859
Substrate
Meas. Tech.
ChEMBL_1824424 (CHEMBL4324188)
IC50
3000±n/a nM
Citation
 Röhm, SBerger, BTSchröder, MChaikuad, AWinkel, RHekking, KFWBenningshof, JJCMüller, GTesch, RKudolo, MForster, MLaufer, SKnapp, S Fast Iterative Synthetic Approach toward Identification of Novel Highly Selective p38 MAP Kinase Inhibitors. J Med Chem 62:10757-10782 (2019)  
Target
Name:
Epithelial discoidin domain-containing receptor 1
Synonyms:
CAK DDR1_HUMAN Discoidin domain-containing receptor 1 (DDR1) EDDR1 Epithelial discoidin domain receptor 1 (DDR1) Epithelial discoidin domain-containing receptor 1 (DDR1) Mammary carcinoma kinase 10 NTRK4 Protein-tyrosine kinase RTK 6 TRKE | Tyrosine-protein kinase CAK
Type:
Tyrosine-protein kinase
Mol. Mass.:
101130.02
Organism:
Homo sapiens (Human)
Description:
Q08345
Residue:
913
  
Inhibitor
Name:
BDBM50505859
Synonyms:
CHEMBL4436748
Type:
Small organic molecule
Emp. Form.:
C27H33N5O2
Mol. Mass.:
459.5832
SMILES:
Nc1c(cnn1-c1ccccc1)C(=O)NCc1ccc(cc1)C(=O)NCCCC1CCCCC1
: