Target
P2X purinoceptor 4
Ligand
BDBM22416
Substrate
Meas. Tech.
ChEMBL_1825044 (CHEMBL4324808)
IC50
2450±n/a nM
Citation
 Werner, SMesch, SHillig, RCTer Laak, AKlint, JNeagoe, ILaux-Biehlmann, ADahllöf, HBräuer, NPuetter, VNubbemeyer, RSchulz, SBairlein, MZollner, TMSteinmeyer, A Discovery and Characterization of the Potent and Selective P2X4 Inhibitor  J Med Chem 62:11194-11217 (2019)  
Target
Name:
P2X purinoceptor 4
Synonyms:
P2RX4_RAT Purinergic, P2X4
Type:
Enzyme Catalytic Domain
Mol. Mass.:
43504.16
Organism:
RAT
Description:
Purinergic, P2X4 0 RAT::P51577
Residue:
388
  
Inhibitor
Name:
BDBM22416
Synonyms:
(3S,4R)-3-[(1,3-benzodioxol-5-yloxy)methyl]-4-(4-fluorophenyl)piperidine CHEMBL490 US09969700, Paroxetine [3H]Paroxetine
Type:
radiolabeled ligand
Emp. Form.:
C19H20FNO3
Mol. Mass.:
329.3654
SMILES:
Fc1ccc(cc1)[C@@H]1CCNC[C@H]1COc1ccc2OCOc2c1
: