Target
Protein arginine N-methyltransferase 5
Ligand
BDBM415557
Substrate
Meas. Tech.
ChEMBL_1827493 (CHEMBL4327367)
IC50
1.000000±n/a nM
Citation
 Zhu, KSong, JLTao, HRCheng, ZQJiang, CSZhang, H Discovery of new potent protein arginine methyltransferase 5 (PRMT5) inhibitors by assembly of key pharmacophores from known inhibitors. Bioorg Med Chem Lett 28:3693-3699 (2018)  
Target
Name:
Protein arginine N-methyltransferase 5
Synonyms:
72 kDa ICln-binding protein HRMT1L5 IBP72 Jak-binding protein 1 PRMT5/MEP50 complex Protein arginine methyltransferase 5 (PRMT5) SKB1 homolog Shk1 kinase-binding protein 1 homolog
Type:
Enzyme
Mol. Mass.:
72679.99
Organism:
Homo sapiens (Human)
Description:
O14744
Residue:
637
  
Inhibitor
Name:
BDBM415557
Synonyms:
US10428104, Example 88
Type:
Small organic molecule
Emp. Form.:
C17H16ClFN4O4
Mol. Mass.:
394.785
SMILES:
Nc1ncnc2n(ccc12)[C@@H]1O[C@H]([C@H](O)c2ccc(Cl)c(F)c2)[C@@H](O)[C@H]1O
: