Target
Multidrug resistance-associated protein 1
Ligand
BDBM81939
Substrate
Meas. Tech.
ChEMBL_1827613 (CHEMBL4327487)
IC50
4500±n/a nM
Citation
 Rullo, MNiso, MPisani, LCarrieri, AColabufo, NACellamare, SAltomare, CD 1,2,3,4-Tetrahydroisoquinoline/2H-chromen-2-one conjugates as nanomolar P-glycoprotein inhibitors: Molecular determinants for affinity and selectivity over multidrug resistance associated protein 1. Eur J Med Chem 161:433-444 (2019)  
Target
Name:
Multidrug resistance-associated protein 1
Synonyms:
7.6.2.2 ABCC1 ATP-binding cassette, sub-family C, member 1 isoform 1 LTC4 transporter MRP MRP1_HUMAN
Type:
Mol. Mass.:
171597.72
Organism:
Homo sapiens (Human)
Description:
P33527
Residue:
1531
  
Inhibitor
Name:
BDBM81939
Synonyms:
CAS_52-53-9 VERAPAMIL
Type:
Small organic molecule
Emp. Form.:
C27H38N2O4
Mol. Mass.:
454.6016
SMILES:
COc1ccc(CCN(C)CCCC(C#N)(C(C)C)c2ccc(OC)c(OC)c2)cc1OC
: