Target
UDP-glucuronosyltransferase 1A4
Ligand
BDBM50508419
Substrate
Meas. Tech.
ChEMBL_1833057 (CHEMBL4333065)
IC50
>50000±n/a nM
Citation
 Lee, DPagire, HSPagire, SHBae, EJDighe, MKim, MLee, KMJang, YKJaladi, AKJung, KYYoo, EKGim, HELee, SChoi, WIChi, YISong, JSBae, MAJeon, YHLee, GHLiu, KHLee, TPark, SJeon, JHLee, IKAhn, JH Discovery of Novel Pyruvate Dehydrogenase Kinase 4 Inhibitors for Potential Oral Treatment of Metabolic Diseases. J Med Chem 62:575-588 (2019)  
Target
Name:
UDP-glucuronosyltransferase 1A4
Synonyms:
Bilirubin-specific UDPGT isozyme 2 GNT1 UDP-glucuronosyltransferase 1-4 UDP-glucuronosyltransferase 1A4 UGT-1D UGT1*4 UGT1.4 UGT1D hUG-BR2
Type:
Enzyme
Mol. Mass.:
60042.50
Organism:
Homo sapiens (Human)
Description:
P22310
Residue:
534
  
Inhibitor
Name:
BDBM50508419
Synonyms:
CHEMBL4471264
Type:
Small organic molecule
Emp. Form.:
C22H20ClN3O2
Mol. Mass.:
393.866
SMILES:
Cl.O=C1c2ccccc2C(=O)c2c(cccc12)-c1cnn(c1)C1CCNCC1
: