Target
5-hydroxytryptamine receptor 2C
Ligand
BDBM50061558
Substrate
Meas. Tech.
ChEMBL_2809 (CHEMBL617839)
IC50
21±n/a nM
Citation
 Liao, YDeBoer, PMeier, EWikström, H Synthesis and pharmacological evaluation of triflate-substituted analogues of clozapine: identification of a novel atypical neuroleptic. J Med Chem 40:4146-53 (1998)  
Target
Name:
5-hydroxytryptamine receptor 2C
Synonyms:
5-HT2C 5-hydroxytryptamine receptor 2C (5HT2c) 5ht1c Htr2c Serotonin receptor 2a and 2c (5HT2A and 5HT2C)
Type:
Enzyme
Mol. Mass.:
51935.10
Organism:
Rattus norvegicus (Rat)
Description:
P08909
Residue:
460
  
Inhibitor
Name:
BDBM50061558
Synonyms:
2-Methoxy-11-(4-methyl-piperazin-1-yl)-5H-dibenzo[b,e][1,4]diazepine | CHEMBL72794
Type:
Small organic molecule
Emp. Form.:
C19H22N4O
Mol. Mass.:
322.4042
SMILES:
COc1ccc2Nc3ccccc3N=C(N3CCN(C)CC3)c2c1
: