Target
Muscarinic acetylcholine receptor M1
Ligand
BDBM50061557
Substrate
Meas. Tech.
ChEMBL_138292 (CHEMBL744323)
IC50
27±n/a nM
Citation
 Liao, YDeBoer, PMeier, EWikström, H Synthesis and pharmacological evaluation of triflate-substituted analogues of clozapine: identification of a novel atypical neuroleptic. J Med Chem 40:4146-53 (1998)  
Target
Name:
Muscarinic acetylcholine receptor M1
Synonyms:
ACM1_HUMAN Cholinergic receptor, muscarinic 1 | Cholinergic, muscarinic M1
Type:
Protein
Mol. Mass.:
51442.54
Organism:
Homo sapiens (Human)
Description:
P11229
Residue:
460
  
Inhibitor
Name:
BDBM50061557
Synonyms:
11-(4-Methyl-piperazin-1-yl)-5H-dibenzo[b,e][1,4]diazepin-8-ol | CHEMBL70377
Type:
Small organic molecule
Emp. Form.:
C18H20N4O
Mol. Mass.:
308.3776
SMILES:
CN1CCN(CC1)C1=Nc2cc(O)ccc2Nc2ccccc12
: