Target
Histamine H1 receptor
Ligand
BDBM50061559
Substrate
Meas. Tech.
ChEMBL_84701 (CHEMBL692705)
IC50
47±n/a nM
Citation
 Liao, YDeBoer, PMeier, EWikström, H Synthesis and pharmacological evaluation of triflate-substituted analogues of clozapine: identification of a novel atypical neuroleptic. J Med Chem 40:4146-53 (1998)  
Target
Name:
Histamine H1 receptor
Synonyms:
HISTAMINE H1 Hrh1
Type:
Enzyme Catalytic Domain
Mol. Mass.:
55716.35
Organism:
RAT
Description:
HISTAMINE H1 HRH1 RAT::P31390
Residue:
486
  
Inhibitor
Name:
BDBM50061559
Synonyms:
CHEMBL72292 | Trifluoro-methanesulfonic acid 11-(4-methyl-piperazin-1-yl)-5H-dibenzo[b,e][1,4]diazepin-2-yl ester
Type:
Small organic molecule
Emp. Form.:
C19H19F3N4O3S
Mol. Mass.:
440.439
SMILES:
CN1CCN(CC1)C1=Nc2ccccc2Nc2ccc(OS(=O)(=O)C(F)(F)F)cc12
: