Target
Mitogen-activated protein kinase 14
Ligand
BDBM50253154
Substrate
Meas. Tech.
ChEMBL_1837226 (CHEMBL4337359)
IC50
0.800000±n/a nM
Citation
 Astolfi, AKudolo, MBrea, JManni, GManfroni, GPalazzotti, DSabatini, SCecchetti, FFelicetti, TCannalire, RMassari, STabarrini, OLoza, MIFallarino, FCecchetti, VLaufer, SABarreca, ML Discovery of potent p38? MAPK inhibitors through a funnel like workflow combining in silico screening and in vitro validation. Eur J Med Chem 182:0 (2019)  
Target
Name:
Mitogen-activated protein kinase 14
Synonyms:
CSAID-binding protein CSBP1 CSPB1 MAP kinase 14 MAP kinase p38 alpha MAPK14 MK14_HUMAN Mitogen-activated protein kinase p38 alpha Stress-activated protein kinase 2a | p38 MAP kinase alpha/beta
Type:
Serine/threonine-protein kinase
Mol. Mass.:
41286.76
Organism:
Homo sapiens (Human)
Description:
Q16539
Residue:
360
  
Inhibitor
Name:
BDBM50253154
Synonyms:
CHEMBL492265 N-cyclopropyl-4-methyl-3-[1-(2-methylphenyl)phthalazin-6-yl]benzamide
Type:
Small organic molecule
Emp. Form.:
C26H23N3O
Mol. Mass.:
393.4803
SMILES:
Cc1ccccc1-c1nncc2cc(ccc12)-c1cc(ccc1C)C(=O)NC1CC1
: