Target
Histamine H4 receptor
Ligand
BDBM50509071
Substrate
Meas. Tech.
ChEMBL_1837265 (CHEMBL4337398)
EC50
3.5±n/a nM
Citation
 Bartole, ELittmann, TTanaka, MOzawa, TBuschauer, ABernhardt, G [ J Med Chem 62:8338-8356 (2019)  
Target
Name:
Histamine H4 receptor
Synonyms:
AXOR35 GPCR105 HH4R HRH4 Histamine H4 receptor Histamine receptor (H3 and H4) SP9144
Type:
G Protein-Coupled Receptor (GPCR)
Mol. Mass.:
44517.02
Organism:
Homo sapiens (Human)
Description:
Binding assays were using CHO cells stably expressing hH4R receptors.
Residue:
390
  
Inhibitor
Name:
BDBM50509071
Synonyms:
CHEMBL4455324
Type:
Small organic molecule
Emp. Form.:
C17H25F6N5O4
Mol. Mass.:
477.4019
SMILES:
OC(=O)C(F)(F)F.OC(=O)C(F)(F)F.CC(C)(C)CNc1nccc(n1)N1CC[C@@H](N)C1
: