Target
Histamine H4 receptor
Ligand
BDBM50413498
Substrate
Meas. Tech.
ChEMBL_1837249 (CHEMBL4337382)
EC50
4.5±n/a nM
Citation
 Bartole, ELittmann, TTanaka, MOzawa, TBuschauer, ABernhardt, G [ J Med Chem 62:8338-8356 (2019)  
Target
Name:
Histamine H4 receptor
Synonyms:
AXOR35 GPCR105 HH4R HRH4 Histamine H4 receptor Histamine receptor (H3 and H4) SP9144
Type:
G Protein-Coupled Receptor (GPCR)
Mol. Mass.:
44517.02
Organism:
Homo sapiens (Human)
Description:
Binding assays were using CHO cells stably expressing hH4R receptors.
Residue:
390
  
Inhibitor
Name:
BDBM50413498
Synonyms:
CHEMBL475621 | UR-PI294
Type:
Small organic molecule
Emp. Form.:
C10H17N5O
Mol. Mass.:
223.2749
SMILES:
CCC(=O)NC(N)=NCCCc1cnc[nH]1
: