Target
Histamine H4 receptor
Ligand
BDBM50509078
Substrate
Meas. Tech.
ChEMBL_1837267 (CHEMBL4337400)
EC50
6.9±n/a nM
Citation
 Bartole, ELittmann, TTanaka, MOzawa, TBuschauer, ABernhardt, G [ J Med Chem 62:8338-8356 (2019)  
Target
Name:
Histamine H4 receptor
Synonyms:
AXOR35 GPCR105 HH4R HRH4 Histamine H4 receptor Histamine receptor (H3 and H4) SP9144
Type:
G Protein-Coupled Receptor (GPCR)
Mol. Mass.:
44517.02
Organism:
Homo sapiens (Human)
Description:
Binding assays were using CHO cells stably expressing hH4R receptors.
Residue:
390
  
Inhibitor
Name:
BDBM50509078
Synonyms:
CHEMBL4443126
Type:
Small organic molecule
Emp. Form.:
C18H27F6N5O4
Mol. Mass.:
491.4285
SMILES:
OC(=O)C(F)(F)F.OC(=O)C(F)(F)F.CN[C@@H]1CCN(C1)c1ccnc(NCC(C)(C)C)n1
: