Target
Nuclear factor NF-kappa-B p105 subunit
Ligand
BDBM50062664
Substrate
Meas. Tech.
ChEMBL_143916 (CHEMBL752719)
IC50
>10000±n/a nM
Citation
 Sullivan, RWBigam, CGErdman, PEPalanki, MSAnderson, DWGoldman, MERansone, LJSuto, MJ 2-Chloro-4-(trifluoromethyl)pyrimidine-5-N-(3',5'- bis(trifluoromethyl)phenyl)-carboxamide: a potent inhibitor of NF-kappa B- and AP-1-mediated gene expression identified using solution-phase combinatorial chemistry. J Med Chem 41:413-9 (1998)  
Target
Name:
Nuclear factor NF-kappa-B p105 subunit
Synonyms:
NFKB1 Nuclear factor NF-kappa-B (NF-kB) Nuclear factor NF-kappa-B p105 subunit
Type:
Protein
Mol. Mass.:
105329.57
Organism:
Homo sapiens (Human)
Description:
P19838
Residue:
968
  
Inhibitor
Name:
BDBM50062664
Synonyms:
2-Chloro-4-trifluoromethyl-pyrimidine-5-carboxylic acid butylamide | CHEMBL134773
Type:
Small organic molecule
Emp. Form.:
C10H11ClF3N3O
Mol. Mass.:
281.662
SMILES:
CCCCNC(=O)c1cnc(Cl)nc1C(F)(F)F
: