Target
Nuclear receptor ROR-beta
Ligand
BDBM382201
Substrate
Meas. Tech.
ChEMBL_1837938 (CHEMBL4338071)
IC50
>10000±n/a nM
Citation
 Marcoux, DDuan, JJShi, QCherney, RJSrivastava, ASCornelius, LBatt, DGLiu, QBeaudoin-Bertrand, MWeigelt, CAKhandelwal, PVishwakrishnan, SSelvakumar, KKarmakar, AGupta, AKBasha, MRamlingam, SManjunath, NVanteru, SKarmakar, SMaddala, NVetrichelvan, MGupta, ARampulla, RAMathur, AYip, SLi, PWu, DRKhan, JRuzanov, MSack, JSWang, JYarde, MCvijic, MELi, SShuster, DJBorowski, VXie, JHMcIntyre, KWObermeier, MTFura, AStefanski, KCornelius, GHynes, JTino, JAMacor, JESalter-Cid, LDenton, RZhao, QCarter, PHDhar, TGM Rationally Designed, Conformationally Constrained Inverse Agonists of ROR?t-Identification of a Potent, Selective Series with Biologic-Like in Vivo Efficacy. J Med Chem 62:9931-9946 (2019)  
Target
Name:
Nuclear receptor ROR-beta
Synonyms:
NR1F2 Nuclear receptor subfamily 1 group F member 2 RORB_HUMAN Retinoid-related orphan receptor-beta
Type:
PROTEIN
Mol. Mass.:
53227.30
Organism:
Homo sapiens (Human)
Description:
ChEMBL_107979
Residue:
470
  
Inhibitor
Name:
BDBM382201
Synonyms:
US10273259, Example 13 | US10711020, Example 13
Type:
Small organic molecule
Emp. Form.:
C29H28F8N2O4S
Mol. Mass.:
652.596
SMILES:
CC(=O)N1CCC(CC1)C(=O)N1CC[C@@]2([C@H]1CCc1cc(ccc21)C(F)(C(F)(F)F)C(F)(F)F)S(=O)(=O)c1ccc(F)cc1
: