Target
Nuclear receptor ROR-beta
Ligand
BDBM50509341
Substrate
Meas. Tech.
ChEMBL_1837938 (CHEMBL4338071)
IC50
>10000±n/a nM
Citation
 Marcoux, DDuan, JJShi, QCherney, RJSrivastava, ASCornelius, LBatt, DGLiu, QBeaudoin-Bertrand, MWeigelt, CAKhandelwal, PVishwakrishnan, SSelvakumar, KKarmakar, AGupta, AKBasha, MRamlingam, SManjunath, NVanteru, SKarmakar, SMaddala, NVetrichelvan, MGupta, ARampulla, RAMathur, AYip, SLi, PWu, DRKhan, JRuzanov, MSack, JSWang, JYarde, MCvijic, MELi, SShuster, DJBorowski, VXie, JHMcIntyre, KWObermeier, MTFura, AStefanski, KCornelius, GHynes, JTino, JAMacor, JESalter-Cid, LDenton, RZhao, QCarter, PHDhar, TGM Rationally Designed, Conformationally Constrained Inverse Agonists of ROR?t-Identification of a Potent, Selective Series with Biologic-Like in Vivo Efficacy. J Med Chem 62:9931-9946 (2019)  
Target
Name:
Nuclear receptor ROR-beta
Synonyms:
NR1F2 Nuclear receptor subfamily 1 group F member 2 RORB_HUMAN Retinoid-related orphan receptor-beta
Type:
PROTEIN
Mol. Mass.:
53227.30
Organism:
Homo sapiens (Human)
Description:
ChEMBL_107979
Residue:
470
  
Inhibitor
Name:
BDBM50509341
Synonyms:
CHEMBL4465091
Type:
Small organic molecule
Emp. Form.:
C29H27F8NO5S
Mol. Mass.:
653.581
SMILES:
[H][C@@]12CCc3cc(ccc3[C@@]1(CCN2C(=O)[C@@H]1CC[C@@H](CC1)C(O)=O)S(=O)(=O)c1ccc(F)cc1)C(F)(C(F)(F)F)C(F)(F)F
: