Target
Serine/threonine-protein kinase pim-1
Ligand
BDBM50510164
Substrate
Meas. Tech.
ChEMBL_1840683 (CHEMBL4340982)
EC50
110±n/a nM
Citation
 Martínez-González, SRodríguez-Arístegui, SGómez de la Oliva, CAHernández, AIGonzález Cantalapiedra, EVarela, CGarcía, ABRabal, OOyarzabal, JBischoff, JRKlett, JAlbarrán, MICebriá, AAjenjo, NGarcía-Serelde, BGómez-Casero, ECuadrado-Urbano, MCebrián, DBlanco-Aparicio, CPastor, J Discovery of novel triazolo[4,3-b]pyridazin-3-yl-quinoline derivatives as PIM inhibitors. Eur J Med Chem 168:87-109 (2019)  
Target
Name:
Serine/threonine-protein kinase pim-1
Synonyms:
PIM-1 Kinase PIM1_HUMAN Serine/threonine-protein kinase (PIM1) Serine/threonine-protein kinase PIM1 | Serine/threonine-protein kinase pim-1 (PIM1)
Type:
Protein
Mol. Mass.:
35681.82
Organism:
Homo sapiens (Human)
Description:
P11309
Residue:
313
  
Inhibitor
Name:
BDBM50510164
Synonyms:
CHEMBL4521827
Type:
Small organic molecule
Emp. Form.:
C23H25N7O
Mol. Mass.:
415.4909
SMILES:
CN1CCOc2c1cnn1c(nnc21)-c1ccc2ccnc(NC3CCCCC3)c2c1
: