Target
Bile acid receptor
Ligand
BDBM50510480
Substrate
Meas. Tech.
ChEMBL_1841527 (CHEMBL4341826)
IC50
<20000±n/a nM
Citation
 Teno, NYamashita, YMasuda, AIguchi, YOda, KFujimori, KHiramoto, TNishimaki-Mogami, TUne, MGohda, K Identification of potent farnesoid X receptor (FXR) antagonist showing favorable PK profile and distribution toward target tissues: Comprehensive understanding of structure-activity relationship of FXR antagonists. Bioorg Med Chem 27:2220-2227 (2019)  
Target
Name:
Bile acid receptor
Synonyms:
BAR FXR HRR1 NR1H4_HUMAN RIP14 Retinoid X receptor-interacting protein 14 | farnesoid x receptor
Type:
Nuclear Receptor
Mol. Mass.:
55916.24
Organism:
Homo sapiens (Human)
Description:
Q96RI1
Residue:
486
  
Inhibitor
Name:
BDBM50510480
Synonyms:
CHEMBL4455235
Type:
Small organic molecule
Emp. Form.:
C32H27ClN4O3
Mol. Mass.:
551.035
SMILES:
Cc1ccc2nc([C@H](Cc3ccc(Cl)cc3)N3C(=O)CN(C3=O)c3ccc(Oc4ccccc4)cc3)n(C)c2c1
: