Target
Sigma non-opioid intracellular receptor 1
Ligand
BDBM50010774
Substrate
Meas. Tech.
ChEMBL_200969 (CHEMBL802057)
Ki
27.7±n/a nM
Citation
 John, CSLim, BBVilner, BJGeyer, BCBowen, WD Substituted halogenated arylsulfonamides: a new class of sigma receptor binding tumor imaging agents. J Med Chem 41:2445-50 (1998)  
Target
Name:
Sigma non-opioid intracellular receptor 1
Synonyms:
Aging-associated gene 8 protein SGMR1_HUMAN SIGMAR1 SR31747-binding protein Sigma 1-type opioid receptor Sigma1R | hSigmaR1
Type:
Enzyme Catalytic Domain
Mol. Mass.:
25124.85
Organism:
Homo sapiens (Human)
Description:
Q99720
Residue:
223
  
Inhibitor
Name:
BDBM50010774
Synonyms:
CHEMBL539782 N,N'-Dibenzyl-guanidine; hydrobromide
Type:
Small organic molecule
Emp. Form.:
C15H17N3
Mol. Mass.:
239.3156
SMILES:
N=C(NCc1ccccc1)NCc1ccccc1
: