Target
RAF proto-oncogene serine/threonine-protein kinase
Ligand
BDBM87998
Substrate
Meas. Tech.
ChEMBL_1842493 (CHEMBL4342920)
EC50
5.0±n/a nM
Target
Name:
RAF proto-oncogene serine/threonine-protein kinase
Synonyms:
C-Raf Protein Kinase RAF RAF1 Raf-1 Serine/threonine-protein kinase C-Raf | cRaf
Type:
Serine/threonine-protein kinase
Mol. Mass.:
73082.52
Organism:
Homo sapiens (Human)
Description:
P04049
Residue:
648
  
Inhibitor
Name:
BDBM87998
Synonyms:
US10245267, Example 1029 US9694016, 1029
Type:
Small organic molecule
Emp. Form.:
C28H28F4N4O4
Mol. Mass.:
560.5399
SMILES:
Cc1ncc(NC(=O)c2cccc(c2)C(F)(F)F)cc1-c1cnc(O[C@H]2CCOC[C@H]2F)c(c1)N1CCOCC1
: