Target
Rap guanine nucleotide exchange factor 3
Ligand
BDBM50511914
Substrate
Meas. Tech.
ChEMBL_1846040 (CHEMBL4346467)
IC50
2200±n/a nM
Citation
 Wang, PLuchowska-Sta?ska, Uvan Basten, BChen, HLiu, ZWiejak, JWhelan, PMorgan, DLochhead, EBarker, GRehmann, HYarwood, SJZhou, J Synthesis and Biochemical Evaluation of Noncyclic Nucleotide Exchange Proteins Directly Activated by cAMP 1 (EPAC1) Regulators. J Med Chem 63:5159-5184 (2020)  
Target
Name:
Rap guanine nucleotide exchange factor 3
Synonyms:
CGEF1 EPAC 1 Exchange factor directly activated by cAMP 1 RAPGEF3 Rap1 guanine-nucleotide-exchange factor directly activated by cAMP cAMP-regulated guanine nucleotide exchange factor I
Type:
PROTEIN
Mol. Mass.:
103769.52
Organism:
Homo sapiens (Human)
Description:
ChEMBL_104531
Residue:
923
  
Inhibitor
Name:
BDBM50511914
Synonyms:
CHEMBL4576925
Type:
Small organic molecule
Emp. Form.:
C23H19NO5S
Mol. Mass.:
421.466
SMILES:
COc1ccc2ccc(OCC(=O)NS(=O)(=O)c3ccc4ccccc4c3)cc2c1
: