Target
Beta-lactamase
Ligand
BDBM50067910
Substrate
Meas. Tech.
ChEMBL_35528 (CHEMBL649554)
Ki
200±n/a nM
Citation
 Weston, GSBlázquez, JBaquero, FShoichet, BK Structure-based enhancement of boronic acid-based inhibitors of AmpC beta-lactamase. J Med Chem 41:4577-86 (1998)  
Target
Name:
Beta-lactamase
Synonyms:
AMPC_ECOLI Beta-lactamase (AmpC) Cephalosporinase ampA | ampC
Type:
Protien
Mol. Mass.:
41561.62
Organism:
Escherichia coli
Description:
P00811
Residue:
377
  
Inhibitor
Name:
BDBM50067910
Synonyms:
4,4'-Bis-dihydroxyboranyl-biphenyl CHEMBL109227 | biphenyl-4,4'-diyldiboronic acid
Type:
Small organic molecule
Emp. Form.:
C12H12B2O4
Mol. Mass.:
241.843
SMILES:
OB(O)c1ccc(cc1)-c1ccc(cc1)B(O)O
: