Target
Serine-protein kinase ATM
Ligand
BDBM420857
Substrate
Meas. Tech.
ChEMBL_1852127 (CHEMBL4352751)
Ki
47±n/a nM
Citation
 Knegtel, RCharrier, JDDurrant, SDavis, CO'Donnell, MStorck, PMacCormick, SKay, DPinder, JVirani, ATwin, HGriffiths, MReaper, PLittlewood, PYoung, SGolec, JPollard, J Rational Design of 5-(4-(Isopropylsulfonyl)phenyl)-3-(3-(4-((methylamino)methyl)phenyl)isoxazol-5-yl)pyrazin-2-amine (VX-970, M6620): Optimization of Intra- and Intermolecular Polar Interactions of a New Ataxia Telangiectasia Mutated and Rad3-Related (ATR) Kinase Inhibitor. J Med Chem 62:5547-5561 (2019)  
Target
Name:
Serine-protein kinase ATM
Synonyms:
A-T mutated ATM_HUMAN | Ataxia telangiectasia mutated
Type:
Protein
Mol. Mass.:
350696.72
Organism:
Homo sapiens (Human)
Description:
Q13315
Residue:
3056
  
Inhibitor
Name:
BDBM420857
Synonyms:
US10479784, Compound IIA-10 | US10961232, Compound IIA-10
Type:
Small organic molecule
Emp. Form.:
C25H27N5O3S
Mol. Mass.:
477.579
SMILES:
CCNCc1ccc(cc1)-c1cc(on1)-c1nc(cnc1N)-c1ccc(cc1)S(=O)(=O)C(C)C
: