Target
Cysteinyl leukotriene receptor 1/2
Ligand
BDBM50215411
Substrate
Meas. Tech.
ChEMBL_99997 (CHEMBL710522)
IC50
0.400000±n/a nM
Citation
 von Sprecher, AGerspacher, MBeck, AKimmel, SWiestner, HAnderson, GPNiederhauser, USubramanian, NBray, MA Synthesis and SAR of a novel, potent and structurally simple LTD4 antagonist of the quinoline class. Bioorg Med Chem Lett 8:965-70 (1999)  
Target
Name:
Cysteinyl leukotriene receptor 1/2
Synonyms:
Cysteinyl leukotriene receptor
Type:
Mol. Mass.:
Description:
ASSAY_ID of ChEMBL is 98640
Components:
This complex has 2 components.
Component 1
Name:
Cysteinyl leukotriene receptor 1
Synonyms:
CLTR1_HUMAN CYSLTR1 Cysteinyl leukotriene receptor HG55 LTD4 receptor | Leukotriene Cysteinyl 1
Type:
Enzyme Catalytic Domain
Mol. Mass.:
38565.16
Organism:
Homo sapiens (Human)
Description:
Leukotriene Cysteinyl 1 CYSLTR1 HUMAN::Q9Y271
Residue:
337
  
Component 2
Name:
Cysteinyl leukotriene receptor 2
Synonyms:
CLTR2_HUMAN CYSLT2R Cysteinyl leukotriene receptor Leukotriene Cysteinyl 2
Type:
Enzyme Catalytic Domain
Mol. Mass.:
39657.52
Organism:
Homo sapiens (Human)
Description:
Leukotriene Cysteinyl 2 CYSLTR2 HUMAN::Q9NS75
Residue:
346
  
Inhibitor
Name:
BDBM50215411
Synonyms:
CHEMBL425675
Type:
Small organic molecule
Emp. Form.:
C25H25FN2O3
Mol. Mass.:
420.476
SMILES:
CCC(CC)(CC(=O)Nc1cccc(\C=C\c2ccc3ccc(F)cc3n2)c1)C(O)=O
: