Target
Interleukin-1 receptor-associated kinase 4
Ligand
BDBM50514927
Substrate
Meas. Tech.
ChEMBL_1859087 (CHEMBL4359943)
IC50
250±n/a nM
Citation
 Bryan, MCDrobnick, JGobbi, AKolesnikov, AChen, YRajapaksa, NNdubaku, CFeng, JChang, WFrancis, RYu, CChoo, EFDeMent, KRan, YAn, LEmson, CHuang, ZSujatha-Bhaskar, SBrightbill, HDiPasquale, AMaher, JWai, JMcKenzie, BSLupardus, PJZarrin, AAKiefer, JR Development of Potent and Selective Pyrazolopyrimidine IRAK4 Inhibitors. J Med Chem 62:6223-6240 (2019)  
Target
Name:
Interleukin-1 receptor-associated kinase 4
Synonyms:
IRAK-4 IRAK4_HUMAN Interleukin-1 receptor-associated kinase 4 (IRAK4) | Renal carcinoma antigen NY-REN-64
Type:
Protein
Mol. Mass.:
51519.08
Organism:
Homo sapiens (Human)
Description:
Q9NWZ3
Residue:
460
  
Inhibitor
Name:
BDBM50514927
Synonyms:
CHEMBL4460055
Type:
Small organic molecule
Emp. Form.:
C24H28N8O3
Mol. Mass.:
476.5309
SMILES:
OCC1CCN(CC1)c1cc2nc([nH]c2cc1NC(=O)c1cnn2cccnc12)N1CCOCC1
: