Target
Gastrin/cholecystokinin type B receptor
Ligand
BDBM50070420
Substrate
Meas. Tech.
ChEMBL_40216 (CHEMBL653062)
Ki
14±n/a nM
Citation
 Bellier, BDa Nascimento, SMeudal, HGincel, ERoques, BPGarbay, C Novel constrained CCK-B dipeptoid antagonists derived from pipecolic acid. Bioorg Med Chem Lett 8:1419-24 (1999)  
Target
Name:
Gastrin/cholecystokinin type B receptor
Synonyms:
Cckbr Cholecystokinin B receptor GASR_RAT | Gastrin/cholecystokinin type B receptor
Type:
Enzyme Catalytic Domain
Mol. Mass.:
48980.43
Organism:
RAT
Description:
Cholecystokinin A CCKBR RAT::P30553
Residue:
452
  
Inhibitor
Name:
BDBM50070420
Synonyms:
(2S,4S)-1-[(S)-2-(Adamantan-2-yloxycarbonylamino)-3-(1H-indol-3-yl)-2-methyl-propionyl]-4-(2,4-dichloro-phenoxy)-piperidine-2-carboxylic acid | CHEMBL405468
Type:
Small organic molecule
Emp. Form.:
C35H39Cl2N3O6
Mol. Mass.:
668.607
SMILES:
C[C@@](Cc1c[nH]c2ccccc12)(NC(=O)OC1C2CC3CC(C2)CC1C3)C(=O)N1CC[C@@H](C[C@H]1C(O)=O)Oc1ccc(Cl)cc1Cl
: