Target
Cholesteryl ester transfer protein
Ligand
BDBM50312718
Substrate
Meas. Tech.
ChEMBL_1865111 (CHEMBL4366086)
IC50
100±n/a nM
Citation
 Finlay, HJJiang, JRampulla, RSalvati, MEQiao, JXWang, TCLawrence, RMHarikrishnan, LSKamau, MGTaylor, DSChen, AYAYin, XHuang, CSChang, MChen, XQSleph, PGXu, CLi, JLevesque, PAdam, LPWexler, RR Discovery of a Lead Triphenylethanamine Cholesterol Ester Transfer Protein (CETP) Inhibitor. ACS Med Chem Lett 10:911-916 (2019)  
Target
Name:
Cholesteryl ester transfer protein
Synonyms:
CETP Cholesteryl ester transfer protein (CETP) | Lipid transfer protein I
Type:
Enzyme
Mol. Mass.:
54751.53
Organism:
Homo sapiens (Human)
Description:
P11597
Residue:
493
  
Inhibitor
Name:
BDBM50312718
Synonyms:
CHEMBL479527 | torcetrapib
Type:
Small organic molecule
Emp. Form.:
C26H25F9N2O4
Mol. Mass.:
600.4733
SMILES:
CCOC(=O)N1[C@H](CC)C[C@H](N(Cc2cc(cc(c2)C(F)(F)F)C(F)(F)F)C(=O)OC)c2cc(ccc12)C(F)(F)F
: