Target
5-hydroxytryptamine receptor 6
Ligand
BDBM35254
Substrate
Meas. Tech.
ChEMBL_1865787 (CHEMBL4366762)
Ki
7.0±n/a nM
Citation
 Ali, WWi?cek, M?a?ewska, DKurczab, RJastrz?bska-Wi?sek, MSata?a, GKucwaj-Brysz, KLubelska, AG?uch-Lutwin, MMordyl, BSiwek, ANasim, MJPartyka, ASudo?, SLatacz, GWeso?owska, AKie?-Kononowicz, KHandzlik, J Synthesis and computer-aided SAR studies for derivatives of phenoxyalkyl-1,3,5-triazine as the new potent ligands for serotonin receptors 5-HT Eur J Med Chem 178:740-751 (2019)  
Target
Name:
5-hydroxytryptamine receptor 6
Synonyms:
5-HT-6 5-hydroxytryptamine receptor 6 (5-HT-6) 5-hydroxytryptamine receptor 6 (5HT6) HTR6 Serotonin 6 (5-HT6) receptor | Serotonin Receptor 6
Type:
G Protein-Coupled Receptor (GPCR)
Mol. Mass.:
46968.43
Organism:
Homo sapiens (Human)
Description:
P50406
Residue:
440
  
Inhibitor
Name:
BDBM35254
Synonyms:
2-methyl-4-(4-methylpiperazin-1-yl)-10H-thieno[2,3-b][1,5]benzodiazepine Olansek Zyprexa | olanzapine
Type:
Small organic molecule
Emp. Form.:
C17H20N4S
Mol. Mass.:
312.432
SMILES:
CN1CCN(CC1)C1=Nc2ccccc2Nc2sc(C)cc12
: