Target
Endothelin-1 receptor
Ligand
BDBM50071427
Substrate
Meas. Tech.
ChEBML_65820
Ki
130±n/a nM
Citation
 Sakaki, JMurata, TYuumoto, YNakamura, ITrueh, TPitterna, TIwasaki, GOda, KYamamura, THayakawa, K Discovery of IRL 3461: a novel and potent endothelin antagonist with balanced ETA/ETB affinity. Bioorg Med Chem Lett 8:2241-6 (1999)  
Target
Name:
Endothelin-1 receptor
Synonyms:
EDNRA ET-A ETA-R Endothelin receptor type A hET-AR
Type:
Enzyme Catalytic Domain
Mol. Mass.:
48736.88
Organism:
Homo sapiens (Human)
Description:
P25101
Residue:
427
  
Inhibitor
Name:
BDBM50071427
Synonyms:
(S)-2-[(R)-2-[(3,5-Dimethyl-benzoyl)-methyl-amino]-3-(4-isoxazol-3-yl-phenyl)-propionylamino]-3-(1H-indol-3-yl)-propionic acid | CHEMBL73697
Type:
Small organic molecule
Emp. Form.:
C33H32N4O5
Mol. Mass.:
564.631
SMILES:
CN([C@H](Cc1ccc(cc1)-c1ccon1)C(=O)N[C@@H](Cc1c[nH]c2ccccc12)C(O)=O)C(=O)c1cc(C)cc(C)c1
: