Target
Peptidyl-prolyl cis-trans isomerase FKBP1A
Ligand
BDBM50071450
Substrate
Meas. Tech.
ChEBML_66285
EC50
12±n/a nM
Citation
 Goulet, MTMcAlpine, SRStaruch, MJKoprak, SDumont, FJCryan, JGWiederrecht, GJRosa, RWilusz, MBPeterson, LBWyvratt, MJParsons, WH C32-O-imidazol-2-yl-methyl ether derivatives of the immunosuppressant ascomycin with improved therapeutic potential. Bioorg Med Chem Lett 8:2253-8 (1999)  
Target
Name:
Peptidyl-prolyl cis-trans isomerase FKBP1A
Synonyms:
12 kDa FK506-binding protein FK506-binding protein 1A FKB1A_HUMAN FKBP-1A FKBP12 Immunophilin FKBP12 PPIase FKBP1A Rotamase mTOR/FKBP12A/FKBP12B
Type:
Isomerase
Mol. Mass.:
11953.09
Organism:
Homo sapiens (Human)
Description:
P62942
Residue:
108
  
Inhibitor
Name:
BDBM50071450
Synonyms:
Ascomycin derivative | CHEMBL385568
Type:
Small organic molecule
Emp. Form.:
C51H77NO13
Mol. Mass.:
912.156
SMILES:
CC[C@@H]1\C=C(C)\C[C@H](C)C[C@H](OC)[C@H]2O[C@](O)([C@H](C)C[C@@H]2OC)C(=O)C(=O)N2CCCC[C@H]2C(=O)O[C@@H]([C@H](C)[C@@H](O)CC1=O)C(\C)=C\[C@@H]1CC[C@@H](OCOCc2ccccc2)[C@@H](C1)OC
: