Target
Peptidyl-prolyl cis-trans isomerase FKBP1A
Ligand
BDBM50068939
Substrate
Meas. Tech.
ChEBML_66285
EC50
1.6±n/a nM
Citation
 Goulet, MTMcAlpine, SRStaruch, MJKoprak, SDumont, FJCryan, JGWiederrecht, GJRosa, RWilusz, MBPeterson, LBWyvratt, MJParsons, WH C32-O-imidazol-2-yl-methyl ether derivatives of the immunosuppressant ascomycin with improved therapeutic potential. Bioorg Med Chem Lett 8:2253-8 (1999)  
Target
Name:
Peptidyl-prolyl cis-trans isomerase FKBP1A
Synonyms:
12 kDa FK506-binding protein FK506-binding protein 1A FKB1A_HUMAN FKBP-1A FKBP12 Immunophilin FKBP12 PPIase FKBP1A Rotamase mTOR/FKBP12A/FKBP12B
Type:
Isomerase
Mol. Mass.:
11953.09
Organism:
Homo sapiens (Human)
Description:
P62942
Residue:
108
  
Inhibitor
Name:
BDBM50068939
Synonyms:
(E)-(9S,12S,13R,14S,17R,21S,23S,24R,25S,27S)-17-Ethyl-1,14-dihydroxy-12-[(E)-2-((1R,3R,4R)-4-hydroxy-3-methoxy-cyclohexyl)-1-methyl-vinyl]-23,25-dimethoxy-13,19,21,27-tetramethyl-11,28-dioxa-4-aza-tricyclo[22.3.1.0*4,9*]octacos-18-ene-2,3,10,16-tetraone (E)-17-Ethyl-1,14-dihydroxy-12-[(E)-2-(4-hydroxy-3-methoxy-cyclohexyl)-1-methyl-vinyl]-23,25-dimethoxy-13,19,21,27-tetramethyl-11,28-dioxa-4-aza-tricyclo[22.3.1.0*4,9*]octacos-18-ene-2,3,10,16-tetraone 17-Ethyl-1,14-dihydroxy-12-[2-(4-hydroxy-3-methoxy-cyclohexyl)-1-methyl-vinyl]-23,25-dimethoxy-13,19,21,27-tetramethyl-11,28-dioxa-4-aza-tricyclo[22.3.1.0*4,9*]octacos-18-ene-2,3,10,16-tetraone C32-O-cinnamyl ether analogue of L-683590 L-683590
Type:
Small organic molecule
Emp. Form.:
C43H69NO12
Mol. Mass.:
792.0075
SMILES:
CC[C@@H]1\C=C(C)\C[C@H](C)C[C@H](OC)[C@H]2O[C@](O)([C@H](C)C[C@@H]2OC)C(=O)C(=O)N2CCCC[C@H]2C(=O)O[C@@H]([C@H](C)[C@@H](O)CC1=O)C(\C)=C\[C@@H]1CC[C@@H](O)[C@@H](C1)OC
: