Target
Calpain-1 catalytic subunit
Ligand
BDBM50065407
Substrate
Meas. Tech.
ChEBML_43648
IC50
11±n/a nM
Citation
 Tripathy, RGu, ZQDunn, DSenadhi, SEAtor, MAChatterjee, S P2-proline-derived inhibitors of calpain I. Bioorg Med Chem Lett 8:2647-52 (1999)  
Target
Name:
Calpain-1 catalytic subunit
Synonyms:
CAN1_HUMAN CAPN1 Calpain-1 (u-Calpain) Calpain1
Type:
Protein
Mol. Mass.:
81880.51
Organism:
Homo sapiens (Human)
Description:
Residue:
714
  
Inhibitor
Name:
BDBM50065407
Synonyms:
(R)-N-((S)-1-Benzyl-2-oxo-ethyl)-3-benzyloxy-2-methanesulfonylamino-propionamide | CHEMBL315636
Type:
Small organic molecule
Emp. Form.:
C20H24N2O5S
Mol. Mass.:
404.48
SMILES:
CS(=O)(=O)N[C@H](COCc1ccccc1)C(=O)N[C@@H](Cc1ccccc1)C=O
: